BDBM50399282 CHEMBL2180817::US9102622, 13.4
SMILES FS(=O)(=O)CCCCCc1ccc(OCc2ccccc2)cc1
InChI Key InChIKey=XWMLTTOAYSGFCX-UHFFFAOYSA-N
Data  3 KI  2 IC50
  Tab Delimited (TSV)   2D SDfile   Computed 3D by Vconf -m prep SDfile
Find this compound or compounds like it in BindingDB:
Activity Spreadsheet -- Enzyme Inhibition Constant Data from BindingDB
Found 4 hits for monomerid = 50399282
TargetFatty-acid amide hydrolase 1 [30-579](Rattus norvegicus (rat))
University of Connecticut
US Patent
LigandPNGBDBM50399282(CHEMBL2180817 | US9102622, 13.4)
Affinity DataKi:  15nM ΔG°:  -11.1kcal/mole IC50:  180nMT: 2°C. Assay description: All compound solutions are made to a concentration of 10 mM in DMSO. To test the stability of the compounds in enzyme assay conditions, 25 nmoles of ...
In DepthDetails US Patent
TargetCannabinoid receptor 1(Rattus norvegicus (rat))
Northeastern University
Curated by ChEMBL
LigandPNGBDBM50399282(CHEMBL2180817 | US9102622, 13.4)
Affinity DataKi:  118nM. Assay description: Displacement of [3H]CP-55,940 from CB1 receptor in rat brain homogenates
In DepthDetails ArticlePubMed
TargetCannabinoid receptor 2(MOUSE)
Northeastern University
Curated by ChEMBL
LigandPNGBDBM50399282(CHEMBL2180817 | US9102622, 13.4)
Affinity DataKi:  194nM. Assay description: Displacement of [3H]CP-55,940 from mouse CB2 receptor expressed in HEK293 cells
In DepthDetails ArticlePubMed
TargetMonoglyceride lipase(Homo sapiens (Human))
Northeastern University
Curated by ChEMBL
LigandPNGBDBM50399282(CHEMBL2180817 | US9102622, 13.4)
Affinity DataIC50:  201nM. Assay description: Inhibition of recombinant human hexahistidine-tagged MGL expressed in Escherichia coli using AHMMCE as substrate after 15 mins by medium throughput f...
In DepthDetails ArticlePubMed