BDBM50400431 CHEMBL2177810
SMILES Cc1c(OCc2cccc(c2)-c2ccccc2)ccc2c(C)c(CCC(O)=O)c(=O)oc12
InChI Key InChIKey=IRPTXRSHRFVWMZ-UHFFFAOYSA-N
Data  1 IC50
  Tab Delimited (TSV)   2D SDfile   Computed 3D by Vconf -m prep SDfile
Find this compound or compounds like it in BindingDB:
Activity Spreadsheet -- Enzyme Inhibition Constant Data from BindingDB
Found 1 hit for monomerid = 50400431
TargetReplicative DNA helicase(Bacillus anthracis)
Microbiotix
Curated by ChEMBL
LigandPNGBDBM50400431(CHEMBL2177810)
Affinity DataIC50:  7.50E+3nM. Assay description: Inhibition of Bacillus anthracis Sterne 34F2 replicative DNA helicase-mediated ATP-dependent dissociation of Hel-5'FAM:Hel-3'BHQ by FRET assay
In DepthDetails ArticlePubMed