BDBM50401454 CHEMBL2204550
SMILES O=c1nc(oc2cc(OCc3cccnc3)ccc12)N(Cc1cccnc1)c1cccnc1
InChI Key InChIKey=JNVZYXMWYPZSJT-UHFFFAOYSA-N
Data  1 IC50
  Tab Delimited (TSV)   2D SDfile   Computed 3D by Vconf -m prep SDfile
Find this compound or compounds like it in BindingDB:
Activity Spreadsheet -- Enzyme Inhibition Constant Data from BindingDB
Found 1 hit for monomerid = 50401454
TargetDNA-dependent protein kinase catalytic subunit(Homo sapiens (Human))
La Trobe University
Curated by ChEMBL
LigandPNGBDBM50401454(CHEMBL2204550)
Affinity DataIC50:  1.48E+4nM. Assay description: Inhibition of DNA-PK using EPPLSQEAFADLWKK as substrate after 5 mins by ADP-Glo kinase assay
In DepthDetails ArticlePubMed