BDBM50401467 CHEMBL1276622
SMILES O=c1nc(oc2cc(OCc3ccccn3)ccc12)N1CCOCC1
InChI Key InChIKey=ZXDDGAPWFHIYNA-UHFFFAOYSA-N
Data  1 IC50
  Tab Delimited (TSV)   2D SDfile   Computed 3D by Vconf -m prep SDfile
Find this compound or compounds like it in BindingDB:
Activity Spreadsheet -- Enzyme Inhibition Constant Data from BindingDB
Found 1 hit for monomerid = 50401467
TargetDNA-dependent protein kinase catalytic subunit(Homo sapiens (Human))
La Trobe University
Curated by ChEMBL
LigandPNGBDBM50401467(CHEMBL1276622)
Affinity DataIC50:  2.70E+3nM. Assay description: Inhibition of DNA-PK using EPPLSQEAFADLWKK as substrate after 5 mins by ADP-Glo kinase assay
In DepthDetails ArticlePubMed