BDBM50401493 CHEMBL2205246
SMILES CC[C@H](NC)C(=O)N[C@H]1[C@@H](CO)CC[C@H]2CC[C@H](N2C1=O)C(=O)N[C@H](C(=O)NCCCOCCOCCOCCCNC(=O)[C@@H](NC(=O)[C@@H]1CC[C@@H]2CC[C@H](CO)[C@H](NC(=O)[C@H](CC)NC)C(=O)N12)c1ccccc1)c1ccccc1
InChI Key InChIKey=FGDXYJJKIYGYHI-ZDURKQSOSA-N
Data  2 IC50
  Tab Delimited (TSV)   2D SDfile   Computed 3D by Vconf -m prep SDfile
Find this compound or compounds like it in BindingDB:
Activity Spreadsheet -- Enzyme Inhibition Constant Data from BindingDB
Found 2 hits for monomerid = 50401493
TargetBaculoviral IAP repeat-containing protein 2(Homo sapiens (Human))
Fondazione Irccs Istituto Nazionale Dei Tumori
Curated by ChEMBL
LigandPNGBDBM50401493(CHEMBL2205246)
Affinity DataIC50:  1.5nM. Assay description: Displacement of FITC-Smac from human recombinant His-tagged cIAP-1 BIR3 domain (245 to 357 residues) after 3 hrs by fluorescent polarization assay
In DepthDetails ArticlePubMed
TargetE3 ubiquitin-protein ligase XIAP(Homo sapiens (Human))
Fondazione Irccs Istituto Nazionale Dei Tumori
Curated by ChEMBL
LigandPNGBDBM50401493(CHEMBL2205246)
Affinity DataIC50:  26nM. Assay description: Displacement of FITC-Smac from human His-tagged XIAP BIR3 domain (241 to 356 residues) after 3 hrs by fluorescent polarization assay
In DepthDetails ArticlePubMed