BDBM50402381 CHEMBL2207296
SMILES COc1cc2cc(-c3cccc(c3)-c3ccc(cc3)-c3ccccc3)[n+](C)c(C)c2cc1OC
InChI Key InChIKey=WVHPVCZMAVJBJK-UHFFFAOYSA-N
Data  1 Kd
  Tab Delimited (TSV)   2D SDfile   Computed 3D by Vconf -m prep SDfile
Find this compound or compounds like it in BindingDB:
Activity Spreadsheet -- Enzyme Inhibition Constant Data from BindingDB
Found 1 hit for monomerid = 50402381
TargetCell division protein FtsZ(Staphylococcus aureus)
The State University Of New Jersey
Curated by ChEMBL
LigandPNGBDBM50402381(CHEMBL2207296)
Affinity DataKd:  2.00E+3nM. Assay description: Binding affinity to Staphylococcus aureus FtsZ expressed in Escherichia coli cells assessed as dissociation constant by fluorescence spectroscopy
In DepthDetails ArticlePubMed