BDBM50405292 CHEMBL2079630
SMILES C[C@H](NC(=O)[C@H](CC(=O)NO)Cc1ccccc1)C(O)=O
InChI Key InChIKey=OJCFZTVYDSKXNM-ONGXEEELSA-N
Data  2 KI
  Tab Delimited (TSV)   2D SDfile   Computed 3D by Vconf -m prep SDfile
Find this compound or compounds like it in BindingDB:
Activity Spreadsheet -- Enzyme Inhibition Constant Data from BindingDB
Found 2 hits for monomerid = 50405292
TargetNeprilysin(Rattus norvegicus (Rat))
TBA
Curated by ChEMBL
LigandPNGBDBM50405292(CHEMBL2079630)
Affinity DataKi:  1.80nM. Assay description: 50% inhibitory activity against enkephalinase purified from rat kidney with [3H]D-Ala2-Leu-enkephalin (20 nM) as substrate.
In DepthDetails ArticlePubMed
TargetAminopeptidase N(Sus scrofa (Pig))
TBA
Curated by ChEMBL
LigandPNGBDBM50405292(CHEMBL2079630)
Affinity DataKi:  2.90nM. Assay description: Inhibitory activity against aminopeptidase using 10 nM of [3H]Leu-enkephalin as substrate
In DepthDetails ArticlePubMed