BDBM50405933 CHEMBL176800
SMILES CC(=O)NCCCNCCCCN
InChI Key InChIKey=MQTAVJHICJWXBR-UHFFFAOYSA-N
Data  1 KI
PDB links: 1 PDB ID matches this monomer.
  Tab Delimited (TSV)   2D SDfile   Computed 3D by Vconf -m prep SDfile
Find this compound or compounds like it in BindingDB:
Activity Spreadsheet -- Enzyme Inhibition Constant Data from BindingDB
Found 1 hit for monomerid = 50405933
TargetPeroxisomal N(1)-acetyl-spermine/spermidine oxidase(Homo sapiens (Human))
University Of The Pacific
Curated by ChEMBL
LigandPNGBDBM50405933(CHEMBL176800)
Affinity DataKi:  1.37E+6nM. Assay description: Ability to inhibit the deacetylation of [acetyl-3H]-N8-Acetylspermidine deacetylase in rat liver.
In DepthDetails ArticlePubMed