BDBM50408778 CHEMBL147339
SMILES CCCOC(=O)c1ccc(CN)cc1
InChI Key InChIKey=WFPMQKJKXDGHHU-UHFFFAOYSA-N
Data  1 KI
  Tab Delimited (TSV)   2D SDfile   Computed 3D by Vconf -m prep SDfile
Find this compound or compounds like it in BindingDB:
Activity Spreadsheet -- Enzyme Inhibition Constant Data from BindingDB
Found 1 hit for monomerid = 50408778
TargetSerine protease 1(Homo sapiens (Human))
Czech Academy Of Sciences
Curated by ChEMBL
LigandPNGBDBM50408778(CHEMBL147339)
Affinity DataKi:  5.00E+8nM. Assay description: Inhibition of trypsin
In DepthDetails ArticlePubMed