BDBM50408783 CHEMBL357538
SMILES NCc1ccc(cc1)C(=O)NCCc1ccccc1
InChI Key InChIKey=NURXCFJHCRMIPU-UHFFFAOYSA-N
Data  1 KI
  Tab Delimited (TSV)   2D SDfile   Computed 3D by Vconf -m prep SDfile
Find this compound or compounds like it in BindingDB:
Activity Spreadsheet -- Enzyme Inhibition Constant Data from BindingDB
Found 1 hit for monomerid = 50408783
TargetSerine protease 1(Homo sapiens (Human))
Czech Academy Of Sciences
Curated by ChEMBL
LigandPNGBDBM50408783(CHEMBL357538)
Affinity DataKi:  3.00E+8nM. Assay description: Inhibition of trypsin
In DepthDetails ArticlePubMed