BDBM5041 N-(5-tert-Butyl-3,4-dimethyl-1,3-thiazol-2(3H)-ylidene)-5-chloro-2-hydroxybenzenesulfonamide::N-[(2Z)-5-tert-butyl-3,4-dimethyl-2,3-dihydro-1,3-thiazol-2-ylidene]-5-chloro-2-hydroxybenzene-1-sulfonamide::thiazolidenebenzenesulfonamide deriv. 11e
SMILES Cc1c(s\c(=N/S(=O)(=O)c2cc(Cl)ccc2O)n1C)C(C)(C)C
InChI Key InChIKey=LLJAXJFZIUWVSL-VKAVYKQESA-N
Data  4 IC50
  Tab Delimited (TSV)   2D SDfile   Computed 3D by Vconf -m prep SDfile
Find this compound or compounds like it in BindingDB:
Activity Spreadsheet -- Enzyme Inhibition Constant Data from BindingDB
Found 4 hits for monomerid = 5041
TargetGag-Pol polyprotein [588-1027]/[588-1147](Human immunodeficiency virus type 1)
Yamanouchi Pharmaceutical
LigandPNGBDBM5041(N-(5-tert-Butyl-3,4-dimethyl-1,3-thiazol-2(3H)-yli...)
Affinity DataIC50:  32nM. Assay description: The IC50 of reverse transcriptase is the concentration that inhibits 50% of recombinant HIV-1 RT RNA-directed DNA polymerase activity in vitro.
In DepthDetails ArticlePubMed
TargetReverse transcriptase protein(Human immunodeficiency virus 1)
Korea Institute Of Science And Technology
Curated by ChEMBL
LigandPNGBDBM5041(N-(5-tert-Butyl-3,4-dimethyl-1,3-thiazol-2(3H)-yli...)
Affinity DataIC50:  1.00E+3nM. Assay description: Inhibition of HIV1 reverse transcriptase K103N mutant by HeLa-MAGI assay
In DepthDetails ArticlePubMed
TargetGag-Pol polyprotein [588-1127,Y768C]/[588-1147,Y768C](Human immunodeficiency virus type 1)
Yamanouchi Pharmaceutical
LigandPNGBDBM5041(N-(5-tert-Butyl-3,4-dimethyl-1,3-thiazol-2(3H)-yli...)
Affinity DataIC50:  11nM. Assay description: The IC50 of reverse transcriptase is the concentration that inhibits 50% of recombinant HIV-1 RT RNA-directed DNA polymerase activity in vitro.
In DepthDetails ArticlePubMed
TargetGag-Pol polyprotein [588-1027,K690N]/[588-1147,K690N](Human immunodeficiency virus type 1)
Yamanouchi Pharmaceutical
LigandPNGBDBM5041(N-(5-tert-Butyl-3,4-dimethyl-1,3-thiazol-2(3H)-yli...)
Affinity DataIC50:  1.10E+3nM. Assay description: The IC50 of reverse transcriptase is the concentration that inhibits 50% of recombinant HIV-1 RT RNA-directed DNA polymerase activity in vitro.
In DepthDetails ArticlePubMed