BDBM50412835 CHEMBL612051
SMILES CCCCc1cn(nn1)-c1nc(N)c2ncn(C3OC(COS(=O)(=O)NC(=O)c4ccccc4O)C(O)C3O)c2n1
InChI Key InChIKey=KFZKSTNHOKKOFU-UHFFFAOYSA-N
Data  1 KI
  Tab Delimited (TSV)   2D SDfile   Computed 3D by Vconf -m prep SDfile
Find this compound or compounds like it in BindingDB:
Activity Spreadsheet -- Enzyme Inhibition Constant Data from BindingDB
Found 1 hit for monomerid = 50412835
TargetSalicyl-AMP ligase / salicyl-S-ArCP synthetase(Mycobacterium tuberculosis)
University Of Minnesota
Curated by ChEMBL
LigandPNGBDBM50412835(CHEMBL612051)
Affinity DataKi:  1.90nM. Assay description: Inhibition of Mycobacterium tuberculosis MbtA expressed in Escherichia coli assessed as ATP-[32P]Ppi exchange
In DepthDetails ArticlePubMed