BDBM50415642 CHEMBL1081319
SMILES N#CNC(NCCCCc1ccccc1)=NCCc1cnc[nH]1
InChI Key InChIKey=VCFBARYQQKOTIN-UHFFFAOYSA-N
Data  1 EC50
  Tab Delimited (TSV)   2D SDfile   Computed 3D by Vconf -m prep SDfile
Find this compound or compounds like it in BindingDB:
Activity Spreadsheet -- Enzyme Inhibition Constant Data from BindingDB
Found 1 hit for monomerid = 50415642
TargetHistamine H4 receptor(Homo sapiens (Human))
University Of Regensburg
Curated by ChEMBL
LigandPNGBDBM50415642(CHEMBL1081319)
Affinity DataEC50: >1.00E+4nM. Assay description: Agonist activity at human histamine H4 receptor expressed in Sf9 cells coexpressing RGS19 protein by steady-state GTPase assay
In DepthDetails ArticlePubMed