BDBM50415649 CHEMBL1077860
SMILES CC(CCNC(NC#N)=NCCCCc1cnc[nH]1)c1ccccc1
InChI Key InChIKey=NQQWDTFCJAJWQW-UHFFFAOYSA-N
Data  1 EC50
  Tab Delimited (TSV)   2D SDfile   Computed 3D by Vconf -m prep SDfile
Find this compound or compounds like it in BindingDB:
Activity Spreadsheet -- Enzyme Inhibition Constant Data from BindingDB
Found 1 hit for monomerid = 50415649
TargetHistamine H4 receptor(Homo sapiens (Human))
University Of Regensburg
Curated by ChEMBL
LigandPNGBDBM50415649(CHEMBL1077860)
Affinity DataEC50:  141nM. Assay description: Agonist activity at human histamine H4 receptor expressed in Sf9 cells coexpressing RGS19 protein by steady-state GTPase assay
In DepthDetails ArticlePubMed