BDBM50415651 CHEMBL1081318
SMILES N#CNC(NCCCc1ccccc1)=NCCc1cnc[nH]1
InChI Key InChIKey=CGWIQIDEPCKACR-UHFFFAOYSA-N
Data  1 EC50
  Tab Delimited (TSV)   2D SDfile   Computed 3D by Vconf -m prep SDfile
Find this compound or compounds like it in BindingDB:
Activity Spreadsheet -- Enzyme Inhibition Constant Data from BindingDB
Found 1 hit for monomerid = 50415651
TargetHistamine H2 receptor(Homo sapiens (Human))
University Of Regensburg
Curated by ChEMBL
LigandPNGBDBM50415651(CHEMBL1081318)
Affinity DataEC50: >1.00E+4nM. Assay description: Agonist activity at human histamine H2 receptor expressed in Sf9 cells coexpressing GsalphaS protein by steady-state GTPase assay
In DepthDetails ArticlePubMed