BDBM50418041 CHEMBL1688402::US10851083, Example 1::US11618744, Example 1
SMILES OC(=O)c1cnn(c1)-c1nc2ccccc2[nH]1
InChI Key InChIKey=MAFPBDKXQKJAPP-UHFFFAOYSA-N
Data  3 IC50
  Tab Delimited (TSV)   2D SDfile   Computed 3D by Vconf -m prep SDfile
Find this compound or compounds like it in BindingDB:
Activity Spreadsheet -- Enzyme Inhibition Constant Data from BindingDB
Found 1 hit for monomerid = 50418041
TargetEgl nine homolog 1 [181-417](Homo sapiens (Human))
Janssen Pharmaceutica
US Patent
LigandPNGBDBM50418041(CHEMBL1688402 | US10851083, Example 1 | US11618744...)
Affinity DataIC50:  794nM. Assay description: The PHD2 181-417 polypeptide (3 μg) was pre-incubated for 30 minutes with test compound prior to assessing the enzymatic activity of the polypep...
In DepthDetails US Patent