BDBM50421271 CHEMBL2087647
SMILES C(Nc1ncnc2[nH]c(c(-c3ccccc3)c12)-c1ccccc1)[C@@H]1CCCO1
InChI Key InChIKey=DWKOHZOFAQOTJK-SFHVURJKSA-N
Data  1 KI  1 IC50
  Tab Delimited (TSV)   2D SDfile   Computed 3D by Vconf -m prep SDfile
Find this compound or compounds like it in BindingDB:
Activity Spreadsheet -- Enzyme Inhibition Constant Data from BindingDB
Found 2 hits for monomerid = 50421271
TargetActivated CDC42 kinase 1(Homo sapiens (Human))
Amgen
Curated by ChEMBL
LigandPNGBDBM50421271(CHEMBL2087647)
Affinity DataKi:  6nM. Assay description: Inhibition of N-terminal His6-tagged ACK1 expressed in baculovirus infected Hi5 cells assessed as inhibition of autophosphorylation after 2 hrs by EL...
In DepthDetails ArticlePubMed
TargetActivated CDC42 kinase 1(Mus musculus)
Amgen
Curated by ChEMBL
LigandPNGBDBM50421271(CHEMBL2087647)
Affinity DataIC50:  620nM. Assay description: Inhibition of ACK1 in mouse C8 cells assessed as decrease in cell viability after 20 to 24 hrs
In DepthDetails ArticlePubMed