BDBM504239 (R)-N-(6-(Difluoromethoxy)-2- (2-fluoro-3-hydroxy-3- methylbutyl)-1-oxoisoindolin-5- yl)pyrazolo[1,5-a]pyrimidine-3- carboxamide::US11034698, Example 88
SMILES CC(C)(O)[C@H](F)CN1Cc2cc(NC(=O)c3cnn4cccnc34)c(OC(F)F)cc2C1=O
InChI Key InChIKey=BZPZSXUWVZSSRQ-MRXNPFEDSA-N
Data  1 KI
  Tab Delimited (TSV)   2D SDfile   Computed 3D by Vconf -m prep SDfile
Find this compound or compounds like it in BindingDB:
Activity Spreadsheet -- Enzyme Inhibition Constant Data from BindingDB
Found 1 hit for monomerid = 504239
TargetNuclear receptor ROR-gamma(Homo sapiens (Human))
Genentech
US Patent
LigandPNGBDBM504239((R)-N-(6-(Difluoromethoxy)-2- (2-fluoro-3-hydroxy-...)
Affinity DataKi:  0.5nM. Assay description: The IRAK4 reaction conditions were optimized using an IRAK1-derived peptide (sequence H-KKARFSRFAGSSPSQSSMVAR) to provide a linear reaction rate over...
Ligand InfoPC cidPC sid
In DepthDetails US Patent