BDBM50426416 CHEMBL2326746
SMILES CN(C)CC[C@H](CSc1ccccc1)Nc1ccc(cc1S(=O)(=O)C(F)(F)F)S(=O)(=O)Nc1ncnc2CN(CCc12)C1CCN(Cc2cc(F)ccc2-c2ccc(Cl)cc2)CC1
InChI Key InChIKey=ZURNBNBFNSFMLM-UUWRZZSWSA-N
Data  2 IC50  1 Kd
  Tab Delimited (TSV)   2D SDfile   Computed 3D by Vconf -m prep SDfile
Find this compound or compounds like it in BindingDB:
Activity Spreadsheet -- Enzyme Inhibition Constant Data from BindingDB
Found 3 hits for monomerid = 50426416
TargetBcl-2-like protein 1(Homo sapiens (Human))
Novartis Institutes For Biomedical Research
Curated by ChEMBL
LigandPNGBDBM50426416(CHEMBL2326746)
Affinity DataIC50:  74nM. Assay description: Inhibition of Bcl-xL/BAK (unknown origin) interaction
In DepthDetails ArticlePubMed
TargetApoptosis regulator Bcl-2(Homo sapiens (Human))
Novartis Institutes For Biomedical Research
Curated by ChEMBL
LigandPNGBDBM50426416(CHEMBL2326746)
Affinity DataIC50:  33nM. Assay description: Inhibition of Bcl-2/biotinylated BAK (unknown origin) interaction incubated for 1 hr by surface plasmon resonance analysis
In DepthDetails ArticlePubMed
TargetApoptosis regulator Bcl-2(Homo sapiens (Human))
Novartis Institutes For Biomedical Research
Curated by ChEMBL
LigandPNGBDBM50426416(CHEMBL2326746)
Affinity DataKd:  3nM. Assay description: Binding affinity to Bcl-2 (unknown origin) by surface plasmon resonance analysis
In DepthDetails ArticlePubMed