BDBM50427006 CHEMBL2326854
SMILES O=C(NCCN1CCCCC1)c1cc2ccccc2oc1=O
InChI Key InChIKey=ACWILSOIBHXDHD-UHFFFAOYSA-N
Data  1 KI  1 IC50
  Tab Delimited (TSV)   2D SDfile   Computed 3D by Vconf -m prep SDfile
Find this compound or compounds like it in BindingDB:
Activity Spreadsheet -- Enzyme Inhibition Constant Data from BindingDB
Found 2 hits for monomerid = 50427006
TargetAcetylcholinesterase(Electrophorus electricus (Electric eel))
Universidade Federal De S£O Carlos
Curated by ChEMBL
LigandPNGBDBM50427006(CHEMBL2326854)
Affinity DataKi:  1.38E+4nM. Assay description: Competitive inhibition of Electrophorus electricus AChE using acetylcholine as substrate by Lineweaver-Burk plot method
In DepthDetails ArticlePubMed
TargetAcetylcholinesterase(Electrophorus electricus (Electric eel))
Universidade Federal De S£O Carlos
Curated by ChEMBL
LigandPNGBDBM50427006(CHEMBL2326854)
Affinity DataIC50:  1.26E+4nM. Assay description: Competitive inhibition of Electrophorus electricus AChE using acetylcholine as substrate by Lineweaver-Burk plot method
In DepthDetails ArticlePubMed