BDBM50429228 CHEMBL2332789
SMILES C[C@H](Cc1cccc(F)c1)NCCO[C@H]1CNC[C@H]1Cc1cc(C)cc(N)n1
InChI Key InChIKey=AUSIEXNWJKDTQY-BLIXFSHQSA-N
Data  6 KI
PDB links: 2 PDB IDs match this monomer.
  Tab Delimited (TSV)   2D SDfile   Computed 3D by Vconf -m prep SDfile
Find this compound or compounds like it in BindingDB:
Activity Spreadsheet -- Enzyme Inhibition Constant Data from BindingDB
Found 6 hits for monomerid = 50429228
TargetNitric oxide synthase, brain(Rattus norvegicus (rat))
University Of California
Curated by ChEMBL
LigandPNGBDBM50429228(CHEMBL2332789)
Affinity DataKi:  70nM. Assay description: Inhibition of rat nNOS expressed in Escherichia coli using L-arginine as substrate assessed as formation of nitric oxide by hemoglobin capture assay
TargetNitric oxide synthase, brain(Rattus norvegicus (rat))
University Of California
Curated by ChEMBL
LigandPNGBDBM50429228(CHEMBL2332789)
Affinity DataKi:  71nM. Assay description: Inhibition of rat nNOS expressed in Escherichia coli using L-arginine as substrate assessed as formation of nitric oxide by hemoglobin capture assay
TargetNitric oxide synthase, inducible(Mus musculus (mouse))
University Of California
Curated by ChEMBL
LigandPNGBDBM50429228(CHEMBL2332789)
Affinity DataKi:  860nM. Assay description: Inhibition of mouse iNOS expressed in Escherichia coli using L-arginine as substrate assessed as formation of nitric oxide by hemoglobin capture assa...
In DepthDetails ArticlePubMed
TargetNitric oxide synthase, inducible(Mus musculus (mouse))
University Of California
Curated by ChEMBL
LigandPNGBDBM50429228(CHEMBL2332789)
Affinity DataKi:  7.60E+3nM. Assay description: Inhibition of mouse iNOS expressed in Escherichia coli using L-arginine as substrate assessed as formation of nitric oxide by hemoglobin capture assa...
In DepthDetails ArticlePubMed
TargetNitric oxide synthase, endothelial(Bos taurus (bovine))
University Of California
Curated by ChEMBL
LigandPNGBDBM50429228(CHEMBL2332789)
Affinity DataKi:  2.60E+4nM. Assay description: Inhibition of bovine eNOS expressed in Escherichia coli using L-arginine as substrate assessed as formation of nitric oxide by hemoglobin capture ass...
TargetNitric oxide synthase, endothelial(Bos taurus (bovine))
University Of California
Curated by ChEMBL
LigandPNGBDBM50429228(CHEMBL2332789)
Affinity DataKi:  4.00E+4nM. Assay description: Inhibition of bovine eNOS expressed in Escherichia coli using L-arginine as substrate assessed as formation of nitric oxide by hemoglobin capture ass...