BDBM50429231 CHEMBL2332792
SMILES Cc1cccc(c1)C1CC1NCCO[C@H]1CNC[C@H]1Cc1cc(C)cc(N)n1
InChI Key InChIKey=AMEMBWOWTMXVHT-QBKZBJQZSA-N
Data  3 KI
  Tab Delimited (TSV)   2D SDfile   Computed 3D by Vconf -m prep SDfile
Find this compound or compounds like it in BindingDB:
Activity Spreadsheet -- Enzyme Inhibition Constant Data from BindingDB
Found 3 hits for monomerid = 50429231
TargetNitric oxide synthase, brain(Rattus norvegicus (rat))
University Of California
Curated by ChEMBL
LigandPNGBDBM50429231(CHEMBL2332792)
Affinity DataKi:  175nM. Assay description: Inhibition of rat nNOS expressed in Escherichia coli using L-arginine as substrate assessed as formation of nitric oxide by hemoglobin capture assay
In DepthDetails ArticlePubMed
TargetNitric oxide synthase, inducible(Mus musculus (mouse))
University Of California
Curated by ChEMBL
LigandPNGBDBM50429231(CHEMBL2332792)
Affinity DataKi:  1.20E+4nM. Assay description: Inhibition of mouse iNOS expressed in Escherichia coli using L-arginine as substrate assessed as formation of nitric oxide by hemoglobin capture assa...
In DepthDetails ArticlePubMed
TargetNitric oxide synthase, endothelial(Bos taurus (bovine))
University Of California
Curated by ChEMBL
LigandPNGBDBM50429231(CHEMBL2332792)
Affinity DataKi:  3.10E+4nM. Assay description: Inhibition of bovine eNOS expressed in Escherichia coli using L-arginine as substrate assessed as formation of nitric oxide by hemoglobin capture ass...
In DepthDetails ArticlePubMed