BDBM50431632 CHEMBL2349082
SMILES CCCCCCCCCCCCCCCCCCCC[C@]1(CCC[C@@H]1OP([O-])(=O)OCC[N+](C)(C)C)C(=O)OCC
InChI Key InChIKey=XJKDPCDFJKLTIM-CQTOTRCISA-N
Data  1 IC50
  Tab Delimited (TSV)   2D SDfile   Computed 3D by Vconf -m prep SDfile
Find this compound or compounds like it in BindingDB:
Activity Spreadsheet -- Enzyme Inhibition Constant Data from BindingDB
Found 1 hit for monomerid = 50431632
TargetRAC-alpha serine/threonine-protein kinase(Homo sapiens (Human))
Kyung Hee University
Curated by ChEMBL
LigandPNGBDBM50431632(CHEMBL2349082)
Affinity DataIC50:  6.90E+3nM. Assay description: Inhibition of Akt phosphorylation in human insulin-stimulated A549 cells incubated for 2 hrs prior to insulin-induction measured after 30 mins by ELI...
In DepthDetails ArticlePubMed