BDBM50431636 CHEMBL2349078
SMILES CCCCCCCCCCCCCCCCCCCCCC[C@]1(CCC[C@H]1OP([O-])(=O)OCC[N+](C)(C)C)C(=O)OCC
InChI Key InChIKey=UZAXHACVSIUKFF-VLZNPVHKSA-N
Data  1 IC50
  Tab Delimited (TSV)   2D SDfile   Computed 3D by Vconf -m prep SDfile
Find this compound or compounds like it in BindingDB:
Activity Spreadsheet -- Enzyme Inhibition Constant Data from BindingDB
Found 1 hit for monomerid = 50431636
TargetRAC-alpha serine/threonine-protein kinase(Homo sapiens (Human))
Kyung Hee University
Curated by ChEMBL
LigandPNGBDBM50431636(CHEMBL2349078)
Affinity DataIC50:  5.50E+3nM. Assay description: Inhibition of Akt phosphorylation in human insulin-stimulated A549 cells incubated for 2 hrs prior to insulin-induction measured after 30 mins by ELI...
In DepthDetails ArticlePubMed