BDBM50433289 CHEMBL2376306
SMILES CCC1NC(=O)c2cc(ccc2NC1=O)S(=O)(=O)Nc1ccccc1
InChI Key InChIKey=PNWGVTHXKDWGCL-UHFFFAOYSA-N
Data  1 IC50
  Tab Delimited (TSV)   2D SDfile   Computed 3D by Vconf -m prep SDfile
Find this compound or compounds like it in BindingDB:
Activity Spreadsheet -- Enzyme Inhibition Constant Data from BindingDB
Found 1 hit for monomerid = 50433289
LigandPNGBDBM50433289(CHEMBL2376306)
Affinity DataIC50:  5.01E+3nM. Assay description: Inhibition of human recombinant MGAT2 expressed in insect cell membrane using 2-oleoyl-sn-glycerol and oleoyl coenzyme A as substrate after 40 mins b...
In DepthDetails ArticlePubMed