BDBM50433311 CHEMBL2376444
SMILES CCCCCCCCc1ccc(CC[C@@](CO)(\C=C\P(O)(O)=O)N=[N+]=[N-])cc1
InChI Key InChIKey=IUICHFFRDGVCQT-APHAIJBRSA-N
Data  1 EC50
  Tab Delimited (TSV)   2D SDfile   Computed 3D by Vconf -m prep SDfile
Find this compound or compounds like it in BindingDB:
Activity Spreadsheet -- Enzyme Inhibition Constant Data from BindingDB
Found 1 hit for monomerid = 50433311
TargetSphingosine kinase 1(Homo sapiens (Human))
The City University Of New York
Curated by ChEMBL
LigandPNGBDBM50433311(CHEMBL2376444)
Affinity DataEC50:  8.30E+3nM. Assay description: Activation of recombinant GFP-tagged SK1 (unknown origin) expressed in HEK293 cells using sphingosine as substrate after 30 mins by Cerenkov counting...
In DepthDetails ArticlePubMed