BDBM50433594 CHEMBL2381828
SMILES CCCC(Oc1ccc(cc1)-n1cnc(c1)C(F)(F)F)c1ccc(cc1)C(=O)NCCC(O)=O
InChI Key InChIKey=QLZKWKBLADHIBI-UHFFFAOYSA-N
Data  1 KI
  Tab Delimited (TSV)   2D SDfile   Computed 3D by Vconf -m prep SDfile
Find this compound or compounds like it in BindingDB:
Activity Spreadsheet -- Enzyme Inhibition Constant Data from BindingDB
Found 1 hit for monomerid = 50433594
TargetGlucagon receptor(Homo sapiens (Human))
Pfizer
Curated by ChEMBL
LigandPNGBDBM50433594(CHEMBL2381828)
Affinity DataKi:  220nM. Assay description: Displacement of [125I]-glucagon-cex from human glucagon receptor by cell based assay in presence of 0.2% bovine serum albumin
In DepthDetails ArticlePubMed