BDBM50434116 CHEMBL2381489
SMILES Clc1ccc2sc(=O)[nH]c2c1
InChI Key InChIKey=NOVHYVKPKWACML-UHFFFAOYSA-N
Data  1 IC50
  Tab Delimited (TSV)   2D SDfile   Computed 3D by Vconf -m prep SDfile
Find this compound or compounds like it in BindingDB:
Activity Spreadsheet -- Enzyme Inhibition Constant Data from BindingDB
Found 1 hit for monomerid = 50434116
TargetChymase(Homo sapiens (Human))
Boehringer Ingelheim Pharmaceuticals
Curated by ChEMBL
LigandPNGBDBM50434116(CHEMBL2381489)
Affinity DataIC50:  9.00E+4nM. Assay description: Inhibition of recombinant human chymase using bis(succinoyl-L-alanyl-L-prolyl-L-phenylalanylamide) as substrate after 1 hr by fluorescence assay
In DepthDetails ArticlePubMed