BDBM50436836 CHEMBL2403304
SMILES CC(C)(CCSCCC(=N)P(O)O)CC(O)=O
InChI Key InChIKey=JHJALBBOFQWSOS-UHFFFAOYSA-N
Data  1 IC50
  Tab Delimited (TSV)   2D SDfile   Computed 3D by Vconf -m prep SDfile
Find this compound or compounds like it in BindingDB:
Activity Spreadsheet -- Enzyme Inhibition Constant Data from BindingDB
Found 1 hit for monomerid = 50436836
TargetBetaine--homocysteine S-methyltransferase 1(Homo sapiens (Human))
Academy Of Sciences Of The Czech Republic
Curated by ChEMBL
LigandPNGBDBM50436836(CHEMBL2403304)
Affinity DataIC50:  1.10E+3nM. Assay description: Inhibition of human recombinant BHMT using N-methyl-[14C]-betaine/D,L-homocysteine as substrate after 30 mins by scintiillation counting analysis
In DepthDetails ArticlePubMed