BDBM50438136 CHEMBL2409882
SMILES OC[C@H]1C[C@@H](O)CCN1CCc1ccc(Nc2nc(cs2)-c2cccc(F)c2)cc1
InChI Key InChIKey=GDGDNJKYJBXPAM-RTWAWAEBSA-N
Data  2 IC50  1 EC50
  Tab Delimited (TSV)   2D SDfile   Computed 3D by Vconf -m prep SDfile
Find this compound or compounds like it in BindingDB:
Activity Spreadsheet -- Enzyme Inhibition Constant Data from BindingDB
Found 3 hits for monomerid = 50438136
TargetSphingosine kinase 2(Homo sapiens (Human))
Amgen
Curated by ChEMBL
LigandPNGBDBM50438136(CHEMBL2409882)
Affinity DataIC50: >5.00E+3nM. Assay description: Inhibition of purified human SphK2 assessed as inhibition of formation of [33P]-S1P after 50 mins by scintillation counting
In DepthDetails ArticlePubMed
TargetSphingosine kinase 1(Homo sapiens (Human))
Amgen
Curated by ChEMBL
LigandPNGBDBM50438136(CHEMBL2409882)
Affinity DataIC50:  320nM. Assay description: Inhibition of purified human SphK1 assessed as inhibition of formation of [33P]-S1P after 50 mins by scintillation counting
In DepthDetails ArticlePubMed
TargetSphingosine kinase 1(Homo sapiens (Human))
Amgen
Curated by ChEMBL
LigandPNGBDBM50438136(CHEMBL2409882)
Affinity DataEC50:  1.20E+3nM. Assay description: Inhibition of SphK1 in human WM266-4 cells assessed as inhibition of formation of [17C]-S1P formation after 20 mins by LC-MS analysis
In DepthDetails ArticlePubMed