BDBM50438249 CHEMBL2407997
SMILES CC1Oc2ccc(CN3CCC(CC3)N(C)C)cc2NC1=O
InChI Key InChIKey=ZWBJNDNUMVKDNM-UHFFFAOYSA-N
Data  1 Kd
  Tab Delimited (TSV)   2D SDfile   Computed 3D by Vconf -m prep SDfile
Find this compound or compounds like it in BindingDB:
Activity Spreadsheet -- Enzyme Inhibition Constant Data from BindingDB
Found 1 hit for monomerid = 50438249
TargetPoly [ADP-ribose] polymerase 1(Homo sapiens (Human))
Takeda California
Curated by ChEMBL
LigandPNGBDBM50438249(CHEMBL2407997)
Affinity DataKd:  96nM. Assay description: Binding affinity to catalytic domain of human PARP1 after 5 mins by surface plasmon resonance assay
In DepthDetails ArticlePubMed