BDBM50438257 CHEMBL2407990
SMILES CC1Oc2ccccc2NC1=O
InChI Key InChIKey=PILVMCZSXIINLV-UHFFFAOYSA-N
Data  1 Kd
  Tab Delimited (TSV)   2D SDfile   Computed 3D by Vconf -m prep SDfile
Find this compound or compounds like it in BindingDB:
Activity Spreadsheet -- Enzyme Inhibition Constant Data from BindingDB
Found 1 hit for monomerid = 50438257
TargetPoly [ADP-ribose] polymerase 1(Homo sapiens (Human))
Takeda California
Curated by ChEMBL
LigandPNGBDBM50438257(CHEMBL2407990)
Affinity DataKd:  3.20E+4nM. Assay description: Binding affinity to catalytic domain of human PARP1 after 5 mins by surface plasmon resonance assay
In DepthDetails ArticlePubMed