BDBM50438384 CHEMBL2414006
SMILES NCCCNCCCCCB(O)O
InChI Key InChIKey=WPADTVBHZOIAHR-UHFFFAOYSA-N
Data  1 IC50
PDB links: 1 PDB ID matches this monomer.
  Tab Delimited (TSV)   2D SDfile   Computed 3D by Vconf -m prep SDfile
Find this compound or compounds like it in BindingDB:
Activity Spreadsheet -- Enzyme Inhibition Constant Data from BindingDB
Found 1 hit for monomerid = 50438384
TargetAcetylpolyamine amidohydrolase(Mycoplana ramosa (Gram-negative bacterium))
University Of Pennsylvania
Curated by ChEMBL
LigandPNGBDBM50438384(CHEMBL2414006)
Affinity DataIC50:  2.30E+5nM. Assay description: Inhibition of Mycoplana ramosa APAH expressed in Escherichia coli BL21 (DE3) using BML-KI104 as substrate after 30 mins by fluorimetric assay
In DepthDetails ArticlePubMed