BDBM50438850 CHEMBL2420478
SMILES O=c1nc2n(-c3ccc4cn[nH]c4c3)c3cc(ccc3cc2c(=O)[nH]1)C#N
InChI Key InChIKey=MQJRWTVXGBUOTK-UHFFFAOYSA-N
Data  2 IC50  1 EC50
  Tab Delimited (TSV)   2D SDfile   Computed 3D by Vconf -m prep SDfile
Find this compound or compounds like it in BindingDB:
Activity Spreadsheet -- Enzyme Inhibition Constant Data from BindingDB
Found 3 hits for monomerid = 50438850
TargetDNA-(apurinic or apyrimidinic site) endonuclease(Homo sapiens (Human))
University Of Manchester
Curated by ChEMBL
LigandPNGBDBM50438850(CHEMBL2420478)
Affinity DataIC50: >2.00E+5nM. Assay description: Inhibition of APE-1 (unknown origin) using double-stranded AP-site containing DNA as substrate after 30 mins by fluorescence assay
In DepthDetails ArticlePubMed
TargetTyrosyl-DNA phosphodiesterase 2(Homo sapiens (Human))
University Of Manchester
Curated by ChEMBL
LigandPNGBDBM50438850(CHEMBL2420478)
Affinity DataEC50:  640nM. Assay description: Inhibition of TDP2 (unknown origin) using 4-nitrophenyl phenylphosphonate as substrate after 60 mins
In DepthDetails ArticlePubMed
TargetTyrosyl-DNA phosphodiesterase 2(Homo sapiens (Human))
University Of Manchester
Curated by ChEMBL
LigandPNGBDBM50438850(CHEMBL2420478)
Affinity DataIC50:  3.63E+3nM. Assay description: Inhibition of TDP2 (unknown origin) using 5'-Y-TCCGTTGAAGCCTGCTTT-3' as substrate after 60 mins
In DepthDetails ArticlePubMed