BDBM50438868 CHEMBL2420503
SMILES Oc1cccc(c1)-n1c2cc(Cl)ccc2cc2c1nc(=O)[nH]c2=O
InChI Key InChIKey=JAGVCTQKQHOVNR-UHFFFAOYSA-N
Data  2 IC50  1 EC50
  Tab Delimited (TSV)   2D SDfile   Computed 3D by Vconf -m prep SDfile
Find this compound or compounds like it in BindingDB:
Activity Spreadsheet -- Enzyme Inhibition Constant Data from BindingDB
Found 3 hits for monomerid = 50438868
TargetDNA-(apurinic or apyrimidinic site) endonuclease(Homo sapiens (Human))
University Of Manchester
Curated by ChEMBL
LigandPNGBDBM50438868(CHEMBL2420503)
Affinity DataIC50: >2.00E+5nM. Assay description: Inhibition of APE-1 (unknown origin) using double-stranded AP-site containing DNA as substrate after 30 mins by fluorescence assay
In DepthDetails ArticlePubMed
TargetTyrosyl-DNA phosphodiesterase 2(Homo sapiens (Human))
University Of Manchester
Curated by ChEMBL
LigandPNGBDBM50438868(CHEMBL2420503)
Affinity DataEC50:  480nM. Assay description: Inhibition of TDP2 (unknown origin) using 4-nitrophenyl phenylphosphonate as substrate after 60 mins
In DepthDetails ArticlePubMed
TargetTyrosyl-DNA phosphodiesterase 2(Homo sapiens (Human))
University Of Manchester
Curated by ChEMBL
LigandPNGBDBM50438868(CHEMBL2420503)
Affinity DataIC50:  2.41E+3nM. Assay description: Inhibition of TDP2 (unknown origin) using 5'-Y-TCCGTTGAAGCCTGCTTT-3' as substrate after 60 mins
In DepthDetails ArticlePubMed