BDBM50438904 CHEMBL2420509
SMILES CCc1ccc(cc1)-c1nn(CC2CC2)c2nc(=O)n(C)c(=O)c2n1
InChI Key InChIKey=KSBNRFBJXUKDSX-UHFFFAOYSA-N
Data  1 IC50  1 EC50
  Tab Delimited (TSV)   2D SDfile   Computed 3D by Vconf -m prep SDfile
Find this compound or compounds like it in BindingDB:
Activity Spreadsheet -- Enzyme Inhibition Constant Data from BindingDB
Found 2 hits for monomerid = 50438904
TargetDNA-(apurinic or apyrimidinic site) endonuclease(Homo sapiens (Human))
University Of Manchester
Curated by ChEMBL
LigandPNGBDBM50438904(CHEMBL2420509)
Affinity DataIC50: >2.00E+5nM. Assay description: Inhibition of APE-1 (unknown origin) using double-stranded AP-site containing DNA as substrate after 30 mins by fluorescence assay
In DepthDetails ArticlePubMed
TargetTyrosyl-DNA phosphodiesterase 2(Homo sapiens (Human))
University Of Manchester
Curated by ChEMBL
LigandPNGBDBM50438904(CHEMBL2420509)
Affinity DataEC50:  360nM. Assay description: Inhibition of TDP2 (unknown origin) using 4-nitrophenyl phenylphosphonate as substrate after 60 mins
In DepthDetails ArticlePubMed