BDBM50439786 CHEMBL2419654
SMILES COc1cc2c(Oc3ccc(NC(=O)NN=Cc4ccc(OC(F)(F)F)cc4)cc3F)ccnc2cc1OCCCN1CCOCC1
InChI Key InChIKey=LVZDSAOWSGYQKL-UHFFFAOYSA-N
Data  1 IC50
  Tab Delimited (TSV)   2D SDfile   Computed 3D by Vconf -m prep SDfile
Find this compound or compounds like it in BindingDB:
Activity Spreadsheet -- Enzyme Inhibition Constant Data from BindingDB
Found 1 hit for monomerid = 50439786
TargetHepatocyte growth factor receptor(Homo sapiens (Human))
Shenyang Pharmaceutical University
Curated by ChEMBL
LigandPNGBDBM50439786(CHEMBL2419654)
Affinity DataIC50:  110nM. Assay description: Inhibition of c-MET (unknown origin) using poly(Glu,Tyr) as substrate after 30 mins by HTRF assay
In DepthDetails ArticlePubMed