BDBM50441657 CHEMBL2437491
SMILES CC1(C)SCN(C1C(=O)N[C@@H]1[C@H](O)Cc2ccccc12)C(=O)[C@@H](O)[C@H](Cc1ccccc1)NC(=O)COc1ccccc1
InChI Key InChIKey=YRCXUGKNFBNKLY-RRYHJEBRSA-N
Data  1 Kd
  Tab Delimited (TSV)   2D SDfile   Computed 3D by Vconf -m prep SDfile
Find this compound or compounds like it in BindingDB:
Activity Spreadsheet -- Enzyme Inhibition Constant Data from BindingDB
Found 1 hit for monomerid = 50441657
TargetCathepsin D(Homo sapiens (Human))
Novartis Institutes For Biomedical Research
Curated by ChEMBL
LigandPNGBDBM50441657(CHEMBL2437491)
Affinity DataKd:  142nM. Assay description: Inhibition of cathepsin D (unknown origin)
In DepthDetails ArticlePubMed