BDBM50442671 CHEMBL2442083
SMILES CCN(CC)CCOc1ccc(CCCCc2ccc(OCCN(CC)CC)c(OCCN(CC)CC)c2)cc1OCCN(CC)CC
InChI Key InChIKey=QROCYVPJPWZLIK-UHFFFAOYSA-N
Data  1 IC50
  Tab Delimited (TSV)   2D SDfile   Computed 3D by Vconf -m prep SDfile
Find this compound or compounds like it in BindingDB:
Activity Spreadsheet -- Enzyme Inhibition Constant Data from BindingDB
Found 1 hit for monomerid = 50442671
TargetBaculoviral IAP repeat-containing protein 5(Homo sapiens (Human))
National University Of Singapore
Curated by ChEMBL
LigandPNGBDBM50442671(CHEMBL2442083)
Affinity DataIC50:  2.50E+4nM. Assay description: Inhibition of survivin (unknown origin)
In DepthDetails ArticlePubMed