BDBM50442813 CHEMBL2440736
SMILES NCc1ccc(cc1-c1cccc(c1)C(=O)OC1CCCOC1)C(=O)Nc1ccncc1F
InChI Key InChIKey=YPZQJNJQSCNYGY-UHFFFAOYSA-N
Data  1 IC50
  Tab Delimited (TSV)   2D SDfile   Computed 3D by Vconf -m prep SDfile
Find this compound or compounds like it in BindingDB:
Activity Spreadsheet -- Enzyme Inhibition Constant Data from BindingDB
Found 1 hit for monomerid = 50442813
TargetRho-associated protein kinase 2(Homo sapiens (Human))
Amakem
Curated by ChEMBL
LigandPNGBDBM50442813(CHEMBL2440736)
Affinity DataIC50:  8.70nM. Assay description: Inhibition of ROCK2 (unknown origin) using long S6 kinase peptide as substrate by radiometric assay
In DepthDetails ArticlePubMed