BDBM50442824 CHEMBL2440749
SMILES COC(=O)c1cccc(c1)-c1cc(ccc1CN)C(=O)Nc1ccncc1F
InChI Key InChIKey=QZXGEBGSZFKWLS-UHFFFAOYSA-N
Data  1 IC50
  Tab Delimited (TSV)   2D SDfile   Computed 3D by Vconf -m prep SDfile
Find this compound or compounds like it in BindingDB:
Activity Spreadsheet -- Enzyme Inhibition Constant Data from BindingDB
Found 1 hit for monomerid = 50442824
TargetRho-associated protein kinase 2(Homo sapiens (Human))
Amakem
Curated by ChEMBL
LigandPNGBDBM50442824(CHEMBL2440749)
Affinity DataIC50:  7.80nM. Assay description: Inhibition of ROCK2 (unknown origin) using long S6 kinase peptide as substrate by radiometric assay
In DepthDetails ArticlePubMed