BDBM50442965 CHEMBL3086282
SMILES CNC(N)=NCCC[C@H](NC(=O)[C@H](CC(C)C)NC(=O)NNC(=O)[C@H](Cc1ccccc1)NC(=O)[C@H](CO)NC(=O)[C@H](CC(N)=O)NC(=O)[C@H](Cc1ccc2ccccc2c1)NC(=O)[C@H](N)Cc1ccc(O)cc1)C(=O)N[C@@H](Cc1ccccc1)C(N)=O
InChI Key InChIKey=IHHPKTVZOVMJHK-GWANQGRHSA-N
Data  2 KI
  Tab Delimited (TSV)   2D SDfile   Computed 3D by Vconf -m prep SDfile
Find this compound or compounds like it in BindingDB:
Activity Spreadsheet -- Enzyme Inhibition Constant Data from BindingDB
Found 2 hits for monomerid = 50442965
TargetKiSS-1 receptor(Homo sapiens (Human))
Takeda Pharmaceutical
Curated by ChEMBL
LigandPNGBDBM50442965(CHEMBL3086282)
Affinity DataKi:  0.0320nM. Assay description: Binding affinity to human KISS1R expressed in CHO cell membranes
In DepthDetails ArticlePubMed
TargetKiSS-1 receptor(Rattus norvegicus)
Takeda Pharmaceutical
Curated by ChEMBL
LigandPNGBDBM50442965(CHEMBL3086282)
Affinity DataKi:  0.0510nM. Assay description: Binding affinity to rat KISS1R
In DepthDetails ArticlePubMed