BDBM50442972 CHEMBL3085808
SMILES CNC(N)=NCCC[C@H](NC(=O)[C@H](CC(C)C)NC(=O)NNC(=O)[C@H](Cc1ccccc1)NC(=O)[C@H](CO)NC(=O)[C@H](CC(N)=O)NC(=O)[C@H](Cc1ccncc1)NC(=O)[C@@H](CC(N)=O)NC(=O)[C@@H](N)Cc1ccc(O)cc1)C(=O)N[C@@H](Cc1ccccc1)C(N)=O
InChI Key InChIKey=ZFZUZPTXXFNAJK-XNOQAKMASA-N
Data  2 KI
  Tab Delimited (TSV)   2D SDfile   Computed 3D by Vconf -m prep SDfile
Find this compound or compounds like it in BindingDB:
Activity Spreadsheet -- Enzyme Inhibition Constant Data from BindingDB
Found 2 hits for monomerid = 50442972
TargetKiSS-1 receptor(Rattus norvegicus)
Takeda Pharmaceutical
Curated by ChEMBL
LigandPNGBDBM50442972(CHEMBL3085808)
Affinity DataKi:  0.160nM. Assay description: Binding affinity to rat KISS1R
In DepthDetails ArticlePubMed
TargetKiSS-1 receptor(Homo sapiens (Human))
Takeda Pharmaceutical
Curated by ChEMBL
LigandPNGBDBM50442972(CHEMBL3085808)
Affinity DataKi:  0.210nM. Assay description: Binding affinity to human KISS1R expressed in CHO cell membranes
In DepthDetails ArticlePubMed