BDBM50444855 CHEMBL3099425
SMILES COc1ccc(cc1OC)-c1cnnc(n1)N1CCC(C1)c1cccc(Cl)c1
InChI Key InChIKey=HTIVKEWQTQZBNV-UHFFFAOYSA-N
Data  1 IC50
  Tab Delimited (TSV)   2D SDfile   Computed 3D by Vconf -m prep SDfile
Find this compound or compounds like it in BindingDB:
Activity Spreadsheet -- Enzyme Inhibition Constant Data from BindingDB
Found 1 hit for monomerid = 50444855
TargetInorganic pyrophosphatase(Mycobacterium tuberculosis)
Purdue University
Curated by ChEMBL
LigandPNGBDBM50444855(CHEMBL3099425)
Affinity DataIC50:  5.32E+4nM. Assay description: Inhibition of Mycobacterium tuberculosis PPase using inorganic pyrophosphate as substrate preincubated for 2 mins followed by substrate addition meas...
In DepthDetails ArticlePubMed