BDBM50446570 CHEMBL3109444
SMILES CC(=O)O[C@H]1[C@@H](Oc2cc(OC(C)=O)cc(OC(C)=O)c2C1=O)c1ccc(OC(C)=O)c(OC(C)=O)c1
InChI Key InChIKey=MNNMLZRGKMWAMG-LOSJGSFVSA-N
Data  1 IC50
  Tab Delimited (TSV)   2D SDfile   Computed 3D by Vconf -m prep SDfile
Find this compound or compounds like it in BindingDB:
Activity Spreadsheet -- Enzyme Inhibition Constant Data from BindingDB
Found 1 hit for monomerid = 50446570
TargetArginase(Leishmania amazonensis)
Universidade Federal De S£O Carlos
Curated by ChEMBL
LigandPNGBDBM50446570(CHEMBL3109444)
Affinity DataIC50:  4.80E+3nM. Assay description: Inhibition of Leishmania amazonensis recombinant arginase expressed in Escherichia coli Rosetta (DE3) pLysS using L-arginine as substrate incubated f...
In DepthDetails ArticlePubMed