BDBM50446571 CHEMBL3109442
SMILES CC(=O)O[C@H]1[C@@H](Oc2cc(O)cc(O)c2C1=O)c1ccc(O)c(O)c1
InChI Key InChIKey=NPWRSXJQDKRXOR-DLBZAZTESA-N
Data  1 IC50
  Tab Delimited (TSV)   2D SDfile   Computed 3D by Vconf -m prep SDfile
Find this compound or compounds like it in BindingDB:
Activity Spreadsheet -- Enzyme Inhibition Constant Data from BindingDB
Found 1 hit for monomerid = 50446571
TargetArginase(Leishmania amazonensis)
Universidade Federal De S£O Carlos
Curated by ChEMBL
LigandPNGBDBM50446571(CHEMBL3109442)
Affinity DataIC50:  3.70E+3nM. Assay description: Inhibition of Leishmania amazonensis recombinant arginase expressed in Escherichia coli Rosetta (DE3) pLysS using L-arginine as substrate incubated f...
In DepthDetails ArticlePubMed