BDBM50447943 CHEMBL3115017
SMILES Cc1[nH]n(-c2nc3ccc(C)cc3[nH]2)c(=O)c1Cc1ccc(F)cc1
InChI Key InChIKey=ZTPOXXDDYBSZRX-UHFFFAOYSA-N
Data  1 IC50
  Tab Delimited (TSV)   2D SDfile   Computed 3D by Vconf -m prep SDfile
Find this compound or compounds like it in BindingDB:
Activity Spreadsheet -- Enzyme Inhibition Constant Data from BindingDB
Found 1 hit for monomerid = 50447943
TargetAlpha-ketoglutarate-dependent dioxygenase alkB homolog 3(Homo sapiens (Human))
Hyogo University Of Health Science
Curated by ChEMBL
LigandPNGBDBM50447943(CHEMBL3115017)
Affinity DataIC50:  780nM. Assay description: Inhibition of demethylase activity of PCA-1 (unknown origin) using 3-methyl cytosine oligo DNA as substrate after 1 hr by RT-PCR analysis
In DepthDetails ArticlePubMed