BDBM50448667 CHEMBL3127646
SMILES CCOc1cnn(c1)-c1ccc(nn1)N1CCC(CC1)N1CCc2ccc(F)cc12
InChI Key InChIKey=SUIRPQHNXDKVBP-UHFFFAOYSA-N
Data  2 IC50
  Tab Delimited (TSV)   2D SDfile   Computed 3D by Vconf -m prep SDfile
Find this compound or compounds like it in BindingDB:
Activity Spreadsheet -- Enzyme Inhibition Constant Data from BindingDB
Found 2 hits for monomerid = 50448667
TargetAcyl-CoA desaturase 1(Rattus norvegicus (Rat))
Janssen Research And Development
Curated by ChEMBL
LigandPNGBDBM50448667(CHEMBL3127646)
Affinity DataIC50:  8nM. Assay description: Inhibition of SCD1 in Sprague-Dawley rat liver microsomes using stearoyl-[9,10-3H]-CoA as substrate
In DepthDetails ArticlePubMed
TargetStearoyl-CoA desaturase(Homo sapiens (Human))
Janssen Research And Development
Curated by ChEMBL
LigandPNGBDBM50448667(CHEMBL3127646)
Affinity DataIC50:  9nM. Assay description: Inhibition of SCD1 in human A431 cells assessed as [13C]-palmitic acid conversion to [13C]-palmitoleic acid after 4 hrs by LC/MS analysis
In DepthDetails ArticlePubMed