BDBM50449475 CHEMBL4162111
SMILES Cc1ccc2N=C3N(CC[C@@]3(O)C(=O)c2c1)c1ccc(cc1)[N+]([O-])=O
InChI Key InChIKey=KAUXNLHXGQGFOS-GOSISDBHSA-N
Data  3 IC50
  Tab Delimited (TSV)   2D SDfile   Computed 3D by Vconf -m prep SDfile
Find this compound or compounds like it in BindingDB:
Activity Spreadsheet -- Enzyme Inhibition Constant Data from BindingDB
Found 3 hits for monomerid = 50449475
TargetMyosin-2 heavy chain(Dictyostelium discoideum)
Ghent University
Curated by ChEMBL
LigandPNGBDBM50449475(CHEMBL4162111)
Affinity DataIC50:  2.30E+3nM. Assay description: Inhibition of Dictyostelium discoideum myosin 2 ATPase activity by NADH-coupled assay
In DepthDetails ArticlePubMed
TargetMyosin-2(Bos taurus)
University Of Nevada
Curated by ChEMBL
LigandPNGBDBM50449475(CHEMBL4162111)
Affinity DataIC50:  2.10E+3nM. Assay description: Inhibition of actin-activated bovine heart muscle myosin 2 assessed as phosphate level incubated for 6 to 24 mins by spectrophotometric method
In DepthDetails ArticlePubMed
TargetMyosin-4(Oryctolagus cuniculus)
Ghent University
Curated by ChEMBL
LigandPNGBDBM50449475(CHEMBL4162111)
Affinity DataIC50:  400nM. Assay description: Inhibition of rabbit skeletal muscle myosin 2
In DepthDetails ArticlePubMed