BDBM50449841 CHEMBL3716488
SMILES CCC(CC)C(=O)Nc1ccccc1C(=O)Nc1cccc(c1)C(F)(F)F
InChI Key InChIKey=TVOTZIGTEZBARS-UHFFFAOYSA-N
Data  1 EC50
  Tab Delimited (TSV)   2D SDfile   Computed 3D by Vconf -m prep SDfile
Find this compound or compounds like it in BindingDB:
Activity Spreadsheet -- Enzyme Inhibition Constant Data from BindingDB
Found 1 hit for monomerid = 50449841
TargetRelaxin receptor 1(Homo sapiens (Human))
National Center For Advancing Translational Sciences
Curated by ChEMBL
LigandPNGBDBM50449841(CHEMBL3716488)
Affinity DataEC50:  5.29E+3nM. Assay description: Agonist activity at human RXFP1 expressed in HEK293 cells assessed as increase in cAMP accumulation after 30 mins by HTRF assay
Ligand InfoPC cidPC sid
In DepthDetails ArticlePubMed